Over 1 million tech questions and answers.

error 1935 an error occurred during the installation of assembly

Q: error 1935 an error occurred during the installation of assembly

So it all started when i was trying to install Itunes and right before it was done installing i got this error "An error occurred during the installation of assembly 'Microsoft.VC80.CRT,version="8.0.50727.4053",type="win32,publicKeyToken="1fc8b3b9a1e18e3b",processorArchitecture="x86". Please refer to Help and Support for more information. HRESULT: 0x800736b" . So i do some research and learn that i need a newer version of microsoft visual c++ 2005. I try install that and i get this 'Error 1935. An error occurred during the installation of assembly.
Microsoft.VC80.ATL.type="win32".version="8.050727.4053"."publicKeyToken"="1fc8b3b9a1e18e3b".processorArchitecture="X86"

Ive also noticed some other strange things such as my windows module installer says started and i cant stop it so i think theres something wrong with that and everytime i put in sfc/scannnow it says windows resource protection could not preform the following operation. My windows updates also dont work i get code 80073712.

Please help me I have some skills on the computer but they are somewhat limited but im sure i can follow the instructions.

RELEVANCY SCORE 200
Preferred Solution: error 1935 an error occurred during the installation of assembly

I recommend downloading and running Reimage. It's a computer repair tool that has been proven to identify and fix many Windows problems with a high level of success.

I've used it in the past to identify and fix everything from blue screens (BSOD's), ActiveX errors, corrupt files and processes, dll/exe/sys errors, recover lost memory, Windows update problems, defragging, malware removal etc.

You can download it direct from this link http://downloadreimage.com/download.php. (This link will automatically start a download of Reimage that you can save to your computer.)

A: error 1935 an error occurred during the installation of assembly

some one please help?

Read other 18 answers
RELEVANCY SCORE 150.8

Hello Friends,

This is getting me nuts...please help......

I have reinstalled my Vista home premium 32bit OS, and now i am not able to install my vodaphone router software....during installation of software i get the error messges

Error 1935.An error occurred during the installation of assembly 'Microsoft.VC80.ATL,type="win32",version="8.0.50727.762",publicKeyToken="1fc8b3b9a1e18e3b",processorArchitecture="x86"'. Please refer to Help and Support for more information. HRESULT: 0x800736B3. assembly interface: IAssemblyCacheItem, function: Commit, component: {97F81AF1-0E47-DC99-A01F-C8B3B9A1E18E}

i have looked into even viewer and found...........error

Activation context generation failed for "C:\Program Files\Common Files\AccSys\AccVSSvc.exe". Dependent Assembly Microsoft.VC80.CRT,processorArchitecture="x86",publicKeyToken="1fc8b3b9a1e18e3b",type="win32",version="8.0.50727.762" could not be found. Please use sxstrace.exe for detailed diagnosis

sxstrace.exe could not give me much info.....

please suggest how to proceed...this is fresh installation, not sure if previous installation carrying .Net Framework...

thank you
SBE

A:Error 1935.An error occurred during the installation of assembly 'Microsoft.VC80.ATL,

Hello and welcome to the Vista Forums!

It is not .net Framework that you need, but the Visual C++ Runtimes, in particular the 2005 ones.

? Download and install the following VC++ Redistributables in the following order: 2005; 2005 SP1; 2008; 2008 SP1, 2010

Web addresses:
1. Download details: Microsoft Visual C++ 2005 Redistributable Package (x86)
2. Download details: Microsoft Visual C++ 2005 SP1 Redistributable Package (x86)
3. Download details: Microsoft Visual C++ 2008 Redistributable Package (x86)
4. Download details: Microsoft Visual C++ 2008 SP1 Redistributable Package (x86)
Download details: Microsoft Visual C++ 2010 Redistributable Package (x86)

Retry. That should solve the issue. If it does not, I shall teach you sxstrace.exe!

Richard

Read other 8 answers
RELEVANCY SCORE 122.8

I am trying to install cakewalk SONAR 7 and I get this error when running the installation and start the small window on "c++ 2005":

"Error 1935. An error ocurred during the installation of assembly
'Microsoft.VC80.ALT.type="win 32", version="8.0.50727.762", publickey Token="1fc8b3b9a1e18e3b", processor Architecture="AMD64". Please refer to help and support for more information."
-------------------------------------

When I checked the event viewer, I have a Vista application event ID 33, with the description below,

"Microsoft.VC80.MFC,processorArchitecture="amd64",
publicKeyToken="1fc8b3b9a1e18e3b",type="win32",version="8.0.50727.762"
Could not be found. Please use sxstrace.exe for detailed diagnosis."
--------------------------------------

When I try to run the sxstrace.exe, I have then this message (the error message is in blank.):

"C:\Users\Xxxxx Comp>sxstrace parse -logfile:sxstrace.elt -outfile:sxstrace.txt
Parsing log file sxstrace.elt...
ProcessTrace failed. Error message is:"


I been google this problem and try different approaches for the last 3 days and nothing fix this problem. I try to install microsoft visual c++ 2008 and c++ 2005 and have similar errors.
Any help in this matter will be highly appreciated, right now is a "dead end"...

Thanks, guys in advance for the help in this matter...

A:"Error 1935. An error ocurred during the installation of assembly 'Microsoft.VC80.AL

Hi,

Just to confirm for us, install the Visual C++ redist 2005, then VC++ redist 2005 SP1, then VC++ redist 2008, then VC++ redist 2008 SP1. Only restart PC after last one has finished and do them in order, one at a time. This will take quite a long time, let them finish. Then run windows update and select everything, in particular the updates for the VC++ redists (mainly security updates) and restart PC again. Tell us if anything here fails and any error messages you get. Are any of your applications getting side by side configuration errors? Then try your program install again. Hopefully it will now work. Tell us what happens. Will try and post links later as this post sent off iPhone.

Hope this helps, though you may have already done this.

Richard

P.S. You could try sfc /scannow though I really doubt it will help.

EDIT:

Here are the web addresses in the correct order:

http://www.microsoft.com/downloads/d...displaylang=en

http://www.microsoft.com/downloads/d...displaylang=en

http://www.microsoft.com/downloads/d...displaylang=en

http://www.microsoft.com/downloads/details.aspx?familyid=BA9257CA-337F-4B40-8C14-157CFDFFEE4E&displaylang=en

Read other 2 answers
RELEVANCY SCORE 122.8

Hi,

After months of trying different things I have gave up and come here for help. The problem arrises when trying to install AVG 2012. The error that is displayed during installation is;

"Severity Error
Error code: 0xC0070643
Error Message: General Internal Error.
Additional Message: Installing 3rd party redistributables failed. If Windows update is prepared on your computer, install it, if Windows update was installed recently, verify, please, its successful completion. Try to install AVG then again.

Error 1935. An error occured during the installation of assembly 'Microsoft.VC90.ATL, version='9.0.30729.4148', publicKeyToken="1fc8b3b9a1e18e3b", processorArchivetecture="x86", type="win32", Please refer to help and support for more information. HRESULT: 0x80070002.

Having looked around, people say this is a windows update error. I have followed various links back to microsoft support and ran fixes which have been unsuccessful.

Is there anything that can be done without formatting this laptop?

Thanks
Jason

A:Error 1935 error occured installation of assembly Microsoft VC90.ATL

Having looked further into the problem, if I look at installed windows updates it says no windows updates installed but I know for a fact that Windows Updates are installed.

Read other 2 answers
RELEVANCY SCORE 96.8

When I try and install MS Office Home & Business 2010. I get this message.

Error 1935.An error occurred during the installation of assembly component {66332652-9C28-58B1-A01F-C8B3B9A1E18E}. HRESULT: 0x80070003.


When I looked up the Error code 1935. This is what it says.

Logon failer; The machine you are logging onto is protected by an authentication firewall. The specified account is not allowed to authenticate to the machine.

The strange thing is, That I have already had Office 2010 installed on this PC. It crashed (BSOD) Imagine that. Ever since I reinstalled The ever so reliable windows 7 64-bit OS. For the 5th time in 3 months. I recieve that message. Also one other question. Never mind I will save for another day. Thank you for your time. Have a nice day.

A:MS Office Home & Business 2010 Error 1935.during install of Assembly

This Microsoft Article should help:
Error message when you try to install an Office program: "Error 1935. An error occurred during the installation of assembly component"

Read other 1 answers
RELEVANCY SCORE 86

I'm running XP Pro and I've attempted to install 2 different anti-spam packages over the last couple days (Ella and Spamfighter). On both occasions, installation starts, but when nearly complete, I get an "error 1935. An error occurred during the installation of assembly. Microsoft.MSXML2,publicKey Token="6bd6b9abf34537 8f", version "4.20.9818.0",type="win32",processorArchitecture="X86"
I've seen one forum entry which recommends deleting Mscoree.dll, but I'm hesitant to do this without at least a second opinion.

Any thoughts out there?
 

A:Installation Error 1935

The file mscoree.dll, contains program code used by the Microsoft .NET Framework when running programs ritten in the .NET programming language. If mscoree.dll is unavailable or stopped, and software installed on your computer that is written using .NET will no longer work
Click to expand...

Basically you may not need it if you dont any aps that require .NET runtime.

However if you delete it and find you are having problems, you can redownload it form here:
http://www.dll-files.com/dllindex/dll-files.shtml?mscoree
 

Read other 2 answers
RELEVANCY SCORE 85.2

Hi - I'm trying to install Endnote X3 on my HP elitebook 8530w with a clean install of Win 7 Ultimate N, but keep getting the following error.

Error 1935. An error occurred during installation of assembly 'Microsoft.VC90.CRT, Type=win32, processorArchitecture=x86, publictokenkey="1fc8b3b9a1e18e3b", version="9.0.30729.1". Please refer to help and support for more information

Please help.
Thanks

A:Endnote X3 installation Error 1935

Win 7 Tip: Fix That MSI Installer Bug And Get Apps Running Again

Common issue for all MSI installs in Windows 7. Very easy fix at the link above. Make sure to run the CMD program as administrator. (Start--> Type in "Search Programs and Files" CMD --> right click, "run as administrator")

Good luck

Read other 1 answers
RELEVANCY SCORE 84.4

I surrender.

Updated to Win 10- received 2010 single image error- uninstalled Office 2010 with Fixit utility off of MS website,
Single Image error code- no longer a problem.
Tried to reinstall Office 2010 from CD- error code 1935.
- uninstalled / reinstalled framework.net- nope.
- renamed Microsoft Help Folder- nope.
- re-installed Win 10 off of USB- nope.
- tried to install in compatibility mode for 8.1- nope.

I've ran CCleaner and Norton Utilities hoping they would clean out some left over garbage but that wasn't it.
What I've found online to address this issue either isn't for Win 10 or it's a fix some 3rd Party software.

Any suggestions?

Thanks-
Late

A:Office 2010 installation error 1935.

I have not evaluated that problem in detail, but it may be caused by a broken installation of Net Framework, by some brokenness in Windows Installer or by incorrect registry entries of Office 2010. Anyway, searching for "Office 2010" install 1935 gives me more than 50.000 results...

Read other 6 answers
RELEVANCY SCORE 84.4

Hi, I have an E-Machine running a Vista Home Premium SP1.

My dad just bought the HP Officejet J4550, but doesn't have the CD. I don't if he has it because when I came home, he already left so I downloaded the driver from the hp website. When I tried to install it, "Fatal Error 1935" came up.

I've tried everything to fix it, but it still has that error.
My problem is similar to this one

Can someone please help me fix this problem?

A:HP Officejet 4550 All-in-One Installation Error 1935

Do you have 32 bit or 64 bit Vista Home Premium? (press WinKey and Pause/Break to find out)
Did you download the 32 bit or the 64 bit version of the drivers (you must use the one that matches the OS)
Have you updated all other drivers on your system?
Have you installed Service Pack 2?
Have you checked the requirements for installation on the HP website?
Have you checked the ALERTS in the right hand column of the driver download page?
Did you install the Full Feature software and driver, AND the 2 CRITICAL Updates?

Read other 3 answers
RELEVANCY SCORE 84.4

Thanks both of you. I appreciate your replies.

I've been having trouble installing OpenOffice 3.2.1 (full suite) on my system, but the portable-version of OpenOffice 3.1.1 works fine on my computer. So now I'm wondering why the suite wasn't allowing me to completely install it.

I was directed by OpenOffice-volunteer helpers to get a Windows Installation Cleanup-utility to remove any previous versions of OOo, so I did that, but I haven't removed "Microsoft Visual C++" which seems to be a part of the installation, but I'm not sure about it.

Should I also uninstall that or remove it with that Utility program as well?

I'm still unable to install OpenOffice.org 3.2.1 on Windows XP 64-bit. This installation-problem came to my attention 1st when the OpenOffice installer said I was missing the .msi-file that came with the previous installment of the same program.

Since I didn't know (and still don't remember) which version of OpenOffice.org that was removed from my system before I tried to install the new version of OO, I just came here hoping there was someone, who's familiar with that app, who might be able to solve this installation-problem: Error 1935

---------------
Please follow me as I explain the steps (and messages) I received before I got that installation error-message:

1. Launched OpenOffice.org installer: OOo_3.2.1_Win_x86_install_en-US.exe

2. OpenOffice.org 3.2 Installation Preparation-window appears &... Read more

Read other answers
RELEVANCY SCORE 84.4

Hi there?

I?m trying to install some software. But can?t, I get 2 error messages.

First error
?Error 1935. An error 0ccured during installation of assembly component {Lots of numbers} HRESULT: 0x80070002.

Second error.
Error -1603 fatal error during installation.
Consult windows installer help (msi.chm) or MSDN for more information..

I have been looking around, and I have tried some things.

Install in XP capability.

Run the install as administrator.

Has set the service ?Microsoft installer? from manuel to auto.

Removed the net framework, and installed it again.

Shutoff/turn on computer and close some running programs like skype, messenger antivirus ect.


I?m running Windows 7 64-bit.

It?s only 1 specific software/program I cant install.
Have try?ed on a friend?s Windows 7 64-bit. And there it works fine?.

I have no problem installing other software.

What can I do ??

Thank you?.

A:error 1935, and 1603 under installation of software

Anyone ??

Read other 1 answers
RELEVANCY SCORE 81.2

Hello Everybody,

I've been having the same problem for a very long time. I'm trying to install iTunes for my iPod, but these messages keep on coming up and cancelling the installation:

- The Windows Installer Service could not be accessed (somehow solved today)
- There is a problem with this Windows Installer Package. A program required for this install to complete could not be run. Contact your support personnel or package vendor. (I managed to solve this)
- An error occurred during installation assembly component. <-- this is my problem. I don't know how long I'm already looking for a solution for this problem, but nothing seems to work. I have already done a full virus- and anti-malware scan.

So I was hoping that you guys would come with the solution for my problem?

Kind Regards,
VistaExplorer

P.S. I tried to copy iTunes from my brother on a USB-stick to my laptop, but that doesn't help either.

A:An error occured during installation of assembly component

here's one possibility- Office 2010 wont install keep Getting Error 2908 then 1935

Note that if you have .net framework 3.5 or 4 shown as installed in Control Panel, you can choose to uninstall them. When you do, you will be given the option to Repair them. If so, run the repair.

Again, this is just a possibility.

Read other 20 answers
RELEVANCY SCORE 79.2

i attemped to install Canyon bluetooth CN-BTU3 (blue soleil) into Windows Vista labtop and the message "error 267 occurred during installation". I have already installed the bluetooth devise into my desktop Windows XP without any problem. Any suggestions would be welcome.
 

A:error 267 occurred during installation

Do you have the correct Vista driver? Download Canyon CN-BTU3 Drivers
for Windows Vista....Try one of these links.

Click to download CN-BTU3_v2_Drv_2KXPWV3264.zip

http://driverscollection.com/?file_cid=4073602424124bc88122ce9fa7f



 

Read other 2 answers
RELEVANCY SCORE 79.2

getting an error while installing ms xml 4.0 (error shown in picture) but when i see in programs it created a program.

even i tried installing KB 954430 and KB 979688 but failed in installation (different error).

any better solution for a successful installation ??
thanks in advance.

A:an error occurred during the installation ms xml 4.0

Have you tried installing after disabling your security software? Any active security could be the problem. You might try from safe mode, you will need to be able to enable the Windows Installer in safe mode. Download and save this exe to your desktop for easy access. Boot to Safe Mode (with Networking if you need internet access during the install), click on the SafeMSI.exe to enable the Windows Installer, then try the install again.

SafeMSI.exe freeware starts Windows Installer in Safe Mode

A Guy

Read other 3 answers
RELEVANCY SCORE 78.4

i had installed that and did remove, so when i install now i get an error.
i uninstalled because i have shared files between two Pc but may be one of them was not configured but i didnt see that shared network with each other on that firewall, it just blocked.
 

A:Error occurred during zonealarm's installation

Where it says click here - click on that and get the error message form it.
 

Read other 3 answers
RELEVANCY SCORE 75.6

Hi!

My PC's hard drive failed so I purchased a new Maxtor 80gb PATA HDD today.

I have installed it and ran my Windows XP Home Edition SP2 CD.

In XP installation the hard disk is formatted with no problems and then the files are installed. Then XP says that the computer needs to re-boot to continue setup... so it re-boots and in a black screen it displays:

veryfying DMI Pool Data......Update success
Boot from CD
A disk read error occurred

I have run chkdsk /r in the XP CD and no bad secors were found.

Any ideas??

Kind regards,

David.
 

A:Solved: A disk read error occurred on XP Home Installation

Read other 13 answers
RELEVANCY SCORE 72

After boot the system first shows error window;
hpqtra08.exe - Application Error
Application has failed to initialize(0xc0000135) click on OK to terminate the application.
Then WindowsInstaller flashed then InstantSharedevices pops-up over and over probably 50times with error 2908 and later error 1935 and in between WindowsInstaller flashed.
I thought .NET Framework is the cause so I uninstalled that but no help.
 
I will attach the DDS files for your review.
Thanks in advance.

A:InstantShareDevices and Internal error 2908 and error 1935

Hello, Welcome to BleepingComputer.I'm nasdaq and will be helping you.If you can please print this topic it will make it easier for you to follow the instructions and complete all of the necessary steps.===--RogueKiller--Download & SAVE to your Desktop RogueKiller for 32bit or Roguekiller for 64bit Quit all programs that you may have started.Please disconnect any USB or external drives from the computer before you run this scan!For Vista or Windows 7, right-click and select "Run as Administrator to start"For Windows XP, double-click to start.Wait until Prescan has finished ...Then Click on "Scan" buttonWait until the Status box shows "Scan Finished"click on "delete"Wait until the Status box shows "Deleting Finished"Click on "Report" and copy/paste the content of the Notepad into your next reply.The log should be found in RKreport[1].txt on your DesktopExit/Close RogueKiller+===Search and delete the AdWare, PUP (Potentially Unwanted Program) installed on your computer.Please download AdwCleaner by Xplode onto your Desktop.Close all open programs and internet browsers.Double click on AdwCleaner.exe to run the tool.Click on Delete tab follow the prompts.A log file will automatically open after the scan has finished.Please post the content of that log file with your next answer.You can find the log file at C:\AdwCleaner[Rn].txt (n is a number).=== Please downloadJunkware Removal Tool to your Desktop.Please close your security software to avoid potential conflicts.Run the to... Read more

Read other 2 answers
RELEVANCY SCORE 68.8

Hi, I've repeatedly attempted this, but always get

An error occurred during setup. Restart your computer, then run setup again.

This is an all too typical message you can find associated with many Epson products.

I've tried:
Clean boot
Safe mode (install enabled)
Using an Epson removal tool I finally obtained after my 5th chat with Epson.
An Epson fix deleting temp folder and looking for setup.exe that never appeared.
On my 4th chat I was advised to consult Microsoft.
Manually removing all Epson folders and registry entries I can find.
Disabling firewall and AV

The same CD installed ok on my 6 year-old laptop (both run Windows x64).

I've found a couple of other fixes found by someone looking at the log file.
I've run SFC /Scannow - ok

At best, the scanner is recognised as being connected when plugged in, and appears with a yellow trangle under 'Other Devices' in Device Manager

Any ideas welcome - I'd like to use my new scanner
Thanks

A:Epson V550 driver installation "An error occurred during setup"

Hi, I've found a solution, albeit a tad obscure. Short story:
1. Install the driver normally, noting it fails, and the device is recognised when plugged in and appears in Device Manager under 'Other devices' with a yellow triangle.
2. There right click the device, update driver and browse to the CD used to install the driver initially, and to the driver folder.
Let the update run.

The scanner should now be installed.

From:
http://answers.microsoft.com/en-us/w...?page=2&auth=1

which offers another approach too.

There are quite a few reports of Epson driver installations (various devices) failing with this message. Epson chat eventually referred me to Microsoft.... saying the original message was a Windows error.

Read other 0 answers
RELEVANCY SCORE 66.8

Symptoms: When you try to view any one of the following dialog boxes, the dialog box may appear to be empty or partly empty: Search Companion User Accounts Windows Update Help and Support System Restore When you try to start Microsoft Windows Media Player, you may receive an "An internal application error has occurred" (or a similar) error message.

Internet Explorer may not be able to print. When you click File, and then click Print, the Print dialog box does not appear. The print preview is blank.Cause:This issue may occur if one or more of the Jscript registry key settings are incorrect. This behavior may also occur if the Jscript.dll file is missing or damaged.Method 1: Reregister Jscript.dll and Vbscript.dll Click Start, and then click Run.

In the Open box, type regsvr32 jscript.dll, and then click OK.

Click OK.

Click Start, and then click Run.

In the Open box, type regsvr32 vbscript.dll, and then click OK.

Click OK.If either of the files do not register as expected, or if you receive an error message, the system file may be missing or damaged. To extract the missing file in Microsoft Windows XP, follow these steps: Click Start, and then click Run.

In the Open box, type msconfig, and then click OK.

Click Expand File.

In the File to restore box, type the name of the file that you want to restore.

In the Restore from box, type the path of the Windows XP .cab file where you want to restore the file, or
click Browse From ... Read more

A:How To Fix Windows Media Player Error - An Internal Application Error Has Occurred

i've tried both methods but nothing seems to work. i can't even uninstall the application or reinstall it.
please help if there is another method. thanks.

Read other 5 answers
RELEVANCY SCORE 66.8

Symptoms: When you try to view any one of the following dialog boxes, the dialog box may appear to be empty or partly empty: Search Companion User Accounts Windows Update Help and Support System Restore When you try to start Microsoft Windows Media Player, you may receive an "An internal application error has occurred" (or a similar) error message.

Internet Explorer may not be able to print. When you click File, and then click Print, the Print dialog box does not appear. The print preview is blank.Cause:This issue may occur if one or more of the Jscript registry key settings are incorrect. This behavior may also occur if the Jscript.dll file is missing or damaged.Method 1: Reregister Jscript.dll and Vbscript.dll Click Start, and then click Run.

In the Open box, type regsvr32 jscript.dll, and then click OK.

Click OK.

Click Start, and then click Run.

In the Open box, type regsvr32 vbscript.dll, and then click OK.

Click OK.If either of the files do not register as expected, or if you receive an error message, the system file may be missing or damaged. To extract the missing file in Microsoft Windows XP, follow these steps: Click Start, and then click Run.

In the Open box, type msconfig, and then click OK.

Click Expand File.

In the File to restore box, type the name of the file that you want to restore.

In the Restore from box, type the path of the Windows XP .cab file where you want to restore the file, or
click Browse From ... Read more

A:How To Fix Windows Media Player Error - An Internal Application Error Has Occurred

i've tried both methods but nothing seems to work. i can't even uninstall the application or reinstall it.
please help if there is another method. thanks.

Read other 5 answers
RELEVANCY SCORE 66.8

We recently deployed MBAM. While most users are not having issues, there is a group of users that continuously get prompted for the Recovery key every boot up. They wont even get prompted for the PIN. we have tried:
Turning bitlocker on and off (un-encrypt & re-encrypt)
Suspend and enable. (suspend, reboot, re-enable)

TPM is on &  activated on the problematic machines. they are different models. All computers in the environment are legacy boot (BIOS) and both, but no one is set to only UEFI.

If the UEFI was the issue everyone would have this issue. BIOS is up to date on these machines. These are mainly Lenovo T430 and T460, and one Dell XPS touch screen (2016)
Sadly this is hindering some of the top people within the company. I have researched this error code with no avail. any assistance would be greatly appreciated!  
 

Read other answers
RELEVANCY SCORE 66.8

I have an error message: An error occurred while loading a file. AOL will attempt to restore the file. My emails, however, are affected. I have email icons without subjects. The emails do open but I cannot know what they are or who sent them prior to opening and I cannot download attachments, answer or forward the messages. This is a potential disaster if I cannot fix this quickly.

Any help appreciated.

A:Error message: An error occurred while loading a file. AOL will attempt to restore...

Quote:





Originally Posted by Feetone


I have an error message: An error occurred while loading a file. AOL will attempt to restore the file. My emails, however, are affected. I have email icons without subjects. The emails do open but I cannot know what they are or who sent them prior to opening and I cannot download attachments, answer or forward the messages. This is a potential disaster if I cannot fix this quickly.

Any help appreciated.





ok your issue is aol....

if you need to use aol, go to aol.com you can check your email there via the web so you should have no problems with downloading or what not

now onto aol.... dont use it unless you HAVE to

contact aol for support for their program..

thanks
Wolf~

Read other 4 answers
RELEVANCY SCORE 66.8

First my machine specs:

http://www.evga.com/community/ModsRi...asp?sysid=5160

Im using Windows 7 Ultimate x64.

Im having some issues with my computer freezing, this occurs while using a "patcher" to download content to a mmo game and sometimes while playing 3d games.

My event viewer has this all the time:

--------------------------------------------------------
A corrected hardware error has occurred.

Reported by component: Processor Core
Error Source: Corrected Machine Check
Error Type: Generic Cache Hierarchy Error
Processor ID: 0

The details view of this entry contains further information.
--------------------------------------------------------

[ Name] Microsoft-Windows-WHEA-Logger
[ Guid] {C26C4F3C-3F66-4E99-8F8A-39405CFED220}

EventID 19

Version 0

Level 3

Task 0

Opcode 0

Keywords 0x8000000000000000

- TimeCreated

[ SystemTime] 2010-04-20T19:25:49.490400000Z

EventRecordID 5406

- Correlation

[ ActivityID] {954A60D4-EFE5-4F8B-B054-8D11A7E15C9D}

- Execution

[ ProcessID] 1488
[ ThreadID] 2096

Channel System

Computer blabla-PC

- Security

[ UserID] S-1-5-19


- EventData

ErrorSource 1
ApicId 0
MCABank 3
MciStat 0x9020010c0320100e
MciAddr 0x0
MciMisc 0x0
ErrorType 7
TransactionType 256
Participation 256
RequestType 256
MemorIO 256
MemHierarchyLv... Read more

A:A corrected hardware error has occurred, Generic Cache Hierarchy Error

Please provide this information: http://www.techsupportforum.com/f217...ns-452654.html

Although you haven't mentioned any BSOD's, the info will provide us with some details so we can try to figure this out.

In general, a machine check is related to an error that's recognized by your CPU and reported to Windows. There's not usually much information in the error reports so we have to fiddle around trying to figure it out.

Most often these are either hardware problems (something's busted) or compatibility issues (either software or hardware).

Read other 1 answers
RELEVANCY SCORE 66.8

I turned on my PC today for the first time in maybe 6mo, slow to boot up but that's expected. Got maybe ten minutes into using it (just fine, might I add. Linked to wifi, etc) and Norton popped up needing to restart the computer. Hit restart now, ten minutes
go by, PC is still trying to shut down. Black screen but the fan is running. I shut it off completely, push the power button again, and get the disc error. Try to restart twice with CtrlAltDel but same error. Finally soft reset (or try to, no indication that
holding the power button does anything) and then got the "Error loading operating system" screen. Now depending on how I restart it (trying to boot from the BIOS menu or boot menu) I get the disc read error but eventually come back to the OS error.

Nothing can get me into the system, period. I'm doing this from a secondary non-PC device. Any help is appreciated. I can get by on software fixes but I'm completely useless with hardware so all of the quick fix tips I've vaguely read have mentioned removing
things from the actual console which I'm hoping I won't have to do.
Please help thanks

Read other answers
RELEVANCY SCORE 66.8

Please someone help me!

I am running XP Home edition, with IE 8. All updates have been installed for both packages, in addition all updates for other programs have been updated and installed when appropriate.

MS Office 2000 (With MS Outlook 2003) has been working on my POC almost flawlessly for several years. All of a sudden it has been acting funny. So I decided to reinstalled / repair it.

I have a hard time updating and repairing Office 2000. I keep getting the error message code 1316, networking error. DATA1pro.msi. I have followed MS help site word by word, but to no avail. http://support.microsoft.com/kb/263253

I did a virus info update and full scan
Scanned for spy ware, with two packages, Ad Aware and A-Square.
Defragged
Checkdsk
Registry cleanup
Removed all startup items that arent necessary
Tried disabling the anti-virus software
I also ran an XP system repair and a system file check
Cleared all Temporary Internet Files and cookies, etc. (I usually run http://www.ccleaner.com/ CCleaner on start-up).
I disable the Find Fast Indexer http://support.microsoft.com/default...&Product=ofw97
or http://tinyurl.com/tkwm
Tried to run system restore and did not work.
I copied the entire CD's content to the hard drive and perform following steps:
o xcopy e:\newcopy /f /s /e /i /h
- Opened the Setup.ini file on the hard drive
- Changed the "MSI=Data1Pro.msi" line to "MSI=Data1.msi"
- Saved the changes m... Read more

Read other answers
RELEVANCY SCORE 66.8

Greetings,

I am in desperate need for some assistance. My laptop recently has been giving this message before reaching the desktop: "A disk read error occurred. Press ctrl+alt+del to restart. I have tried restarting multiple times (including manually restarting), but I ended up receiving the same error. My operating system is Windows XP.

What can I do to approach this problem? I would be very grateful for any assistance.

~Trav.~
 

A:Solved: Desperate need for assistance for error message: "A disk read error occurred.

Read other 16 answers
RELEVANCY SCORE 66.8

Hello. Can someone help me please? Windows7 Professional 32Bit.

Whenever i try to enable .NET Framework 3.5.1 in Turn windows features on or off, this error approaches me. What should i do?

Tried sfc /scannow and didn't help at all. Please help me.

Read other answers
RELEVANCY SCORE 66.8

While trying to start up my Dell laptop with Vista Home Basic installed on it, I got an error saying that the winload.exe is missing. I ran the bcdedit commands to set the osdevice and device partitions. While trying to boot again, got an error again this time saying that Kernel is missing or corrupt. I tried to run a repair using the Vista installation cd but the repair failed midway. I tried to do a clean reinstall on the machine which completed successfully. But when I tried to boot the machine again, it gave an error 0xc00000e9 unexpected error has occurred with no other options. Running repair and reinstallation again did not work. I see that a lot of people have faced this problem but I could not find any solution which would work for me. Any clue about how to solve this and what is the cause of this problem? It has been really frustrating till now

A:Vista error while booting: 0xc00000e9 unexpected error has occurred

Hello IamThe,
If the E9 code is correct, then this is the bugcheck for your error.

STOP 0x000000E9: ACTIVE_EX_WORKER_THREAD_TERMINATION

Usual causes: Device driver

As you can see, the most probable cause is a driver.

Have you tried to boot into safe mode ?.
If you can get to safe mode with networking, go to C > Windows > Minidump and upload the files. You may need to save them to desktop before you zip them up and upload them.

Take a look and post your results, good luck.

Read other 6 answers
RELEVANCY SCORE 66.8

I recently re-installed windows and am now trying to install the DirectX End-User Runtimes (June 2010). All goes well, it installs everything, but as it finished I get this error:
I have tried redownloading, using other installers and updating my graphics drivers. Nothing will work. It's probably worth mentioning that the first time I tried installing, about a week ago, my computer totally froze in the middle of the install and I had to force restart.

Any ideas on how to fix this problem?

A:DirectX install error - An internal system error occurred.

Welcome to Seven Forums callumshell1. The 1st thing I would suggest would be to run the System Files Checker.

SFC /SCANNOW Command - System File Checker

See if it finds and corrects any errors. Also, see if you locate the 2 dx logs mentioned, in the windows directory, and post them here, or just the text if they are short, which they may well be.

A Guy

Read other 6 answers
RELEVANCY SCORE 66.8

i just installed google chrome from online installer and then i moved the file using application mover to the HDD.. then i pasted a symlink in "C:\Program Files (x86)\" ... "C:\" is the SSD where the windows and the drivers are installed.... when i turn on chrome everything works file.. but the updater doesn't work... when i try to update i get this:



can anyone help me get that fixed.. thanks!

A:Update failed (error: 3)An error occurred while checking for updates:

Just uninstall Chrome then install it directly to the destination you want it installed instead of moving it post installation.

Read other 3 answers
RELEVANCY SCORE 66.4

While installing HP Scanjet 4070 Photosmart Scanner, the installation stops and will not continue. The message is Fatal Error 1935. Can you help me with this? Any help, greatly appreciated.
 

A:Error 1935

This might be a window installer problem. Try this:

1. Open Control Panel.
2. Double-click Administrative Tools.
3. Double-click Services.
4. Right-click the Windows Installer service.
5. Click Stop.

Then try your install again.
 

Read other 2 answers
RELEVANCY SCORE 66.4

I have run into a problem I can't seem to sort. When attempting to install TurboCad 17.1, I encountered an error that stopped and rolled back the installation. I encountered the same error when trying to install Adobe Acrobat. I have attached a grab of the actual error and the data from the event viewer.

So far, I have tried reinstalling the msxml.msi file from a clean boot with no success. I uninstalled and reinstalled .net Framework 4.0.30319 but the verifier tells me it is not present (I've also attached the log).

I'm pretty much at the end of ideas and would very much appreciate a rescue!

Event Viewer.txt

setupverifier_main_10-15-10_17.59.34.txt

A:1935 Error

TurboCAD Forums - Index

I'm not trying to put you off but did you try the Turbo Cad forum? Above link.
They would probably be the best place to start.

Posting here and there might help.
Mike

Read other 9 answers
RELEVANCY SCORE 66.4

I Have Vista Home edition 32 bit and I am trying to re installed on disc office 2007
and i keep getting a error message Error 1935. An error has occurred during the installation of assembly component {97F81AF1-0E47-DC99-A01F-C8B3B9A1E18E} HRESULT: 0x800736B5
Can you Please help? as I cant sent my Cv out in word format !

Tags: win vista, office 2007, dat mat khau may tinh

A:Error 1935 Please Help ?

Do you have any anti-virus software installed at this time?

Read other 2 answers
RELEVANCY SCORE 66.4

Everytime i try installing programs, i always get this error, Error 1935. what do i do?

A:1935 error

You may want to look over this excellent tutorial and see if it can help you.

Unable To Install Latest Version of Program on Vista[11]=Programs Features

In additon, you may want to download and use ccleaner. It will clean up remnants of prior uninstalls

http://www.ccleaner.com/

Read other 9 answers
RELEVANCY SCORE 66.4

trying to load microsoft office 2007 pro and get error 1935. U sing windows 7 64bit ultimate. how do you get around it,please?

A:error 1935

Have a read here: http://answers.microsoft.com/en-us/office/forum/office_2007-office_install/error-1935-when-installing-microsoft-office-2007/303b4ab8-abac-413b-8275-af358feef934

Read other 1 answers
RELEVANCY SCORE 66.4

Hi, and Merry Xmas to you all.

I have a really crappy problem with an installayion, i am trying to install a 3D art program called Vue 6 Xstream and i keep getting this error message on the install start up. (see attched pic)

I have read loads of stuff about how to solve this but with ne results so i ask you peeps for your knowledge and help

I am green as grass regarding pc terms so bear that in mind if you have any ideas.

I have tried installing the microsoft visual C++ just to see if it was missing and i get the same error message trying to install that from microsoft so i dont think its anything to do with Vue !?

Thanks again,

Kindest regards,

Vale.

Read other answers
RELEVANCY SCORE 66.4

I recently had problems with my computer and had to restore the computer to factory settings, well after I did that I encountered some issues. I tried to reinstall Microsoft Office and can not get it to work. I have been trying for about 3 days and have tried everything. It gets about 99% done and then says Error 1935 Then gives a code of {166332652-9C28-58B1-A01F-C8B3B9A1E18E1} HResult 0x80073712. I have Windows 7 installed and it has .Net framework 4.0, I have tried to uninstall both the version and the extended version, repairing them, reinstalling them, trying the install without having any of them installed and nothing. I have been looking around and found and tried without success renaming mscoree.dll to mscoreebak.dll, even that didnt work. Any help would be greatly appreciated, thank you.

A:Error 1935

Hey Chemeng, sorry to hear about your error.. Have you tried following this?

Error message when you try to install an Office program: "Error 1935. An error occurred during the installation of assembly component"

let us know if that worked or not

good luck!

Read other 7 answers
RELEVANCY SCORE 66.4

Downloaded the dsa car theory test and every time i install it, it gets up to 100% then comes up with

Error 1935.An error occurred during the installation of assembly 'Microsoft.MSXML2,publicKeyToken="6bd6b9abf345378f",version="4.1.0.0",type="win32",processorArchitecture="x86"'. Please refer to Help and Support for more information.

Been searching everywhere on google for the past 2 days nothings helped. Would appreciate if someone has been able to solve this problem and can give me a step by step guide on how to solve it as i'm not a genius on computers!

Thank you.
 

Read other answers
RELEVANCY SCORE 66.4

Hello,

Yesterday I downloaded a plugin to use in a recording program that I've used for years, running the 32-bit version (a 64-bit version is available). When installing the trial plugin, I got a message afterward, which I didn't write down, indicating the install was not successful. I don't remember how the trail of looking online lead me to thinking it was an issue with Microsoft Visual C++, but that's where I ended up. In trying to reinstall C++, I continually get error 1935. I have cleaned the registry, I have 'repaired' the Framework, I have made sure the service associated with trusted installations is running, and yet I can find no way to get x64 C++ to install. So, I uninstalled all instances of it and rebooted. I can get x86 to install, but that's it. Because I deleted the previous instances of c++, my recording application won't even open (citing that mfc110u.dll is missing), and I'm only a few weeks away from a deadline for a project I was supposed to have churned out. Apparently, the x86 plugin doesn't cover x32 and x64 bit programs?
I'm running a Gateway DX4860 with 6 gigs of RAM, 3.30ghz, 64-bit, and Windows 7 Service pack 1. Unfortunately, I was never given a Windows 7 disc with my computer and was told to just back up frequently. I don't have any system restore points, as I just save my music projects backed up to an external drive.
I would be extremely grateful to anyone who may be able to help.
... Read more

A:C++ error 1935

Hi and welcome to TSG.

If possible try reinstalling the recording software. If that's not possible or doesn't help try installing the C++ downloads from here :- http://www.microsoft.com/en-us/download/details.aspx?id=30679

You can try installing the 32 and 64 bit c++ downloads, I'm not sure if you just need 64 bit when running 64 bit windows.

EDIT : I would avoid registry cleaners, they can do more harm than good.
 

Read other 2 answers
RELEVANCY SCORE 66.4

Hi there
Previously (2 days ago) I had Office 2010 beta. I thought it would be a good idea to go ahead and upgrade, so I uninstalled the beta, and tried to install the full version.
At first I got an error involving an installation of Visio 2007 which I removed, and attempted to install Office. It gets about 1/2 way done with any components selected and gives me this error (occurs in both 2010 and 2007):
Error 1935. An error occurred during the installation of assembly component
Now, let me explain some things...
Ive been through hoops with .net, as the KB article says (which is bogus because its built into the OS and you cant uninstall / install / repair it unless you use a 3rd party program which doesn't seem to work and I cant seem to get 2.0 to install anyways)
And Ive been to the registry and back, removing everything related to office.
I have even uninstalled every other program that wasn't crucial to try and get this to work.
Also tried a sfc /scannow
And Scandsk / chkdsk
Tried reinstalling a beta I found online, same error

My machine is Windows 7 x64

Can anyone out there help me?
Thanks.

A:1935 Error

Hello,

Check this article Microsoft Office 2010 encountered an error during setup: Error 1935 and 0x80070005 | Capitalhead.com

- Captain

Read other 9 answers
RELEVANCY SCORE 66.4

Hi gurus

I have a similar problem that I was reading on this post, but I cant seems to fix this problem.

I have a windows 7 home edition laptop, I need to install office 2010 pro plus, but half way into the installation, the error that follows comes up" Error 1935, an error occured during installation of assanbly component {a75f2217-ad54-3ea6-ae14-f255f8660531}-HResult 0x800703f1"
I have unstalled everything that was even close to be related to 2007.
I have unisntalled fw4 and re-installed. the extened, unless i need to installed the full version
but neither of those has fix my problems can some one help please

thanks a bunchhhh
 

A:1935 error

According to Microsoft support this can be caused by missing or damaged installation of Microsoft .NET Framework. You should be able to download from the link below.

http://www.microsoft.com/downloads/en/details.aspx?FamilyID=9cfb2d51-5ff4-4491-b0e5-b386f32c0992

If that doesn't resolve the issue you need to provide us with more info. Is this a legit copy of Office or a bootleg? Are you logged into the machine with admin rights? Are you installing from a network location or local disk? Also have you tried the setup on a different PC to determine if the installation disk is corrupt?

Rollin
 

Read other 1 answers
RELEVANCY SCORE 66

Hello,

I recently switched out an older Netgear router for the Netgear WNDR3300. I have a 1TB WD MyBookWorld connected via ethernet to the router. Ever since the router switch I have been having two specifice issues:While uploading videos to Facebook, the video will upload anywhere from several MB up to over 100 MB, then stall, saying it's still uploading but trust me, it isn't.
I can copy files/folders from the networked hard drive to my computer flawlessly, but when I try to copy files/folders from my computer to the networked hard drive, it copies anywhere from a few seconds to maybe a couple minutes then stalls out, giving the error message:
"Network Error. There was a problem accessing [\\SERVER\FOLDER]... Make sure you are connected to the network and try again." with Retry, Skip and Cancel. When cancel is pressed it gives: "An unexpected error is keeping you from copying the file. If you continue to receive this error, you can use the error code to search for help with this problem. Error 0x8007003B: An unexpected network error occurred.

Other useful information: on the new router, the WNDR3300, if I use WEP security, I can copy files/folders to the hard drive, no problem. However if I try to use WPA/WPA2, the abovementioned problems occur. I would use WEP and just forget the hassle, but WPA2 is much faster and more secure, so I really want to get this fixed.

I also believe the two problems are somehow related, considering they both involve... Read more

A:Error 0x8007003B: An unexpected network error occurred

Hmmmm, Tough Problem.

One of the things it could be is a loose connection, and it keeps on dropping out. Try checking all of your Patch (Ethernet) Cables and reconnecting them all.

As you can copy the files on WEP, it seems like windows is preventing a so called 'Hacker' (You) from copying a 'Virus' (Files) onto the HD. Try to edit the security settings yourself, edit the sharing options in the HD's properties and that might fix it...

Sorry about the long wait.

Read other 4 answers
RELEVANCY SCORE 66

Hello
I have been receiving this error message for the last two weeks while trying to transfer files from a network drive into my laptop. I have a 3TB WD My Book Live connected to my home network through a netgear DGN2000 router. I also use it to stream videos
to a smart tv.
I didn't have any problem ever since I connected it the first time. However, it has started showing up this error message now. I can't copy or move files either way. I tried a number of options, such as reset my router, shut down and reconnected the network
drive but none seem to have worked now. Now, I can't stream videos. Also, I am not able to upgrade the firmware of the network drive.
Any help please.
Thanks

A:Error 0x8007003B: An unexpected network error occurred.

Hi,
Do you have some anti-virus software installed and set to scan network drive, temporarily disable it, check if that is the cause.
I also suggest you update the firmware of your router.
Please alos share more information in event viewer with us as mentioned by ZigZag31343x

Meanwhile you can contact the support of My Book Live
http://wdc.com/en/products/products.aspx?id=280
NOTE
This
response contains a reference to a third party World Wide Web site. Microsoft is providing this information as a convenience to you.
Microsoft
does not control these sites and has not tested any software or information found on these sites.

Regards


Yolanda
TechNet Community Support

Read other 3 answers
RELEVANCY SCORE 66

I work in one academic institute and been used to using teams for a while....Mac version.
I've been invited to work collaboratively with colleagues from another institute that having just started using teams.
I've received various invites, logged initially and its asks permissions for that uni to be able to access my uni account info (fine) but when it gets as far as open up teams (either online or via the Mac app) I end up with the above error message above.
This is my first use of inter-institutional work using teams.
Any ideas please?
Thanks
Kevin

Read other answers
RELEVANCY SCORE 66

Hi,I just started my computer up for the first time and a keep getting a bright red screen with an error saying: "Red Screen!!! - Factory Processing Error Occurred error" It says to restart the computer but it just keeps happening!I bought this computer to be able to work from home on Tuesday so I urgently need this resolved!Thanks!

Read other answers
RELEVANCY SCORE 66

Hi,
i got this error on a win 8.1 pro after a total transfered amount of ~41 MB :
Error 0x8007003B: An unexpected network error occurred.

- connection via sslvpn using a ntfs share on a dfs in a Domain network as letter-mapped share via gpo.


If i use map networkfolder without a letter, it will work fine also with large files with more than 80 MBThe symantec endpoint protection was turned of! Same error...

Read other answers